Reaction Details
TargetDelta-type opioid receptor
LigandBDBM50001683
Substrate/Competitorn/a
Meas. Tech.ChEMBL_145767 (CHEMBL752785)
IC50 1.6±n/a nM
Citation Qian, XKövér, KEShenderovich, MDLou, BSMisicka, AZalewska, THorváth, RDavis, PBilsky, EJPorreca, F Newly discovered stereochemical requirements in the side-chain conformation of delta opioid agonists for recognizing opioid delta receptors. J Med Chem37:1746-57 (1994) Delta-type opioid receptor
Name:Delta-type opioid receptor
Type:Enzyme Catalytic Domain
Mol. Mass.:40577.25
Organism:MOUSE
Description:P32300
Residue:372
BDBM50001683
NameBDBM50001683
Synonyms:13-[2-Amino-3-(4-hydroxy-phenyl)-propionylamino]-7-benzyl-3,3,14,14-tetramethyl-6,9,12-trioxo-1,2-dithia-5,8,11-triaza-cyclotetradecane-4-carboxylic acid CHEMBL294616 | DPDPE
TypeSmall organic molecule
Emp. Form.C30H39N5O7S2
Mol. Mass.645.79
SMILESCC1(C)SSC(C)(C)[C@@H](NC(=O)[C@@H](N)Cc2ccc(O)cc2)C(=O)NCC(=O)N[C@H](Cc2ccccc2)C(=O)N[C@H]1C(O)=O