Reaction Details
TargetNeprilysin
LigandBDBM50038623
Substrate/Competitorn/a
Meas. Tech.ChEMBL_144465 (CHEMBL755112)
IC50 3.6±n/a nM
Citation Gomez-Monterrey, IBeaumont, ANemecek, PRoques, BPFournie-Zaluski, MC New thiol inhibitors of neutral endopeptidase EC 3.4.24.11: synthesis and enzyme active-site recognition. J Med Chem37:1865-73 (1994) Neprilysin
Name:Neprilysin
Type:Enzyme
Mol. Mass.:85570.75
Organism:Oryctolagus cuniculus (rabbit)
Description:NEP was purified to homogeneity from rabbit kidney.
Residue:750
BDBM50038623
NameBDBM50038623
Synonyms:2-(2-Benzyl-3-mercapto-5-methyl-hexanoylamino)-propionic acid | CHEMBL55286
TypeSmall organic molecule
Emp. Form.C17H25NO3S
Mol. Mass.323.45
SMILESCC(C)CC(S)C(Cc1ccccc1)C(=O)NC(C)C(O)=O