Reaction Details
TargetThermolysin
LigandBDBM50038623
Substrate/Competitorn/a
Meas. Tech.ChEMBL_210390 (CHEMBL812110)
IC50 4000±n/a nM
Citation Gomez-Monterrey, IBeaumont, ANemecek, PRoques, BPFournie-Zaluski, MC New thiol inhibitors of neutral endopeptidase EC 3.4.24.11: synthesis and enzyme active-site recognition. J Med Chem37:1865-73 (1994) Thermolysin
Name:Thermolysin
Type:PROTEIN
Mol. Mass.:60097.54
Organism:Bacillus thermoproteolyticus
Description:ChEMBL_1468794
Residue:548
BDBM50038623
NameBDBM50038623
Synonyms:2-(2-Benzyl-3-mercapto-5-methyl-hexanoylamino)-propionic acid | CHEMBL55286
TypeSmall organic molecule
Emp. Form.C17H25NO3S
Mol. Mass.323.45
SMILESCC(C)CC(S)C(Cc1ccccc1)C(=O)NC(C)C(O)=O