Reaction Details
TargetMuscarinic acetylcholine receptor M2
LigandBDBM50366613
Substrate/Competitorn/a
Meas. Tech.ChEMBL_140109 (CHEMBL752110)
Ki>10000±n/a nM
Citation Hudkins, RLMailman, RBDeHaven-Hudkins, DL Novel (4-phenylpiperidinyl)- and (4-phenylpiperazinyl)alkyl-spaced esters of 1-phenylcyclopentanecarboxylic acids as potent sigma-selective compounds. J Med Chem37:1964-70 (1994) Muscarinic acetylcholine receptor M2
Name:Muscarinic acetylcholine receptor M2
Type:Enzyme Catalytic Domain
Mol. Mass.:51555.53
Organism:RAT
Description:P10980
Residue:466
BDBM50366613
NameBDBM50366613
Synonyms:DEXTROMETHORPHAN
TypeSmall organic molecule
Emp. Form.C18H25NO
Mol. Mass.271.3972
SMILESCOc1ccc2C[C@H]3[C@H]4CCCC[C@@]4(CCN3C)c2c1