Reaction Details
TargetPlatelet-activating factor receptor
LigandBDBM50038792
Substrate/Competitorn/a
Meas. Tech.ChEMBL_151699 (CHEMBL760448)
Ki 1±n/a nM
Citation Sheppard, GSPireh, DCarrera, GMBures, MGHeyman, HRSteinman, DHDavidsen, SKPhillips, JGGuinn, DEMay, PD 3-(2-(3-Pyridinyl)thiazolidin-4-oyl)indoles, a novel series of platelet activating factor antagonists. J Med Chem37:2011-32 (1994) Platelet-activating factor receptor
Name:Platelet-activating factor receptor
Type:Protein
Mol. Mass.:39005.63
Organism:Cavia porcellus
Description:n/a
Residue:342
BDBM50038792
NameBDBM50038792
Synonyms:6-Benzyloxy-3-((R)-2-pyridin-3-yl-thiazolidine-4-carbonyl)-indole-1-carboxylic acid tert-butyl ester | CHEMBL64691
TypeSmall organic molecule
Emp. Form.C29H29N3O4S
Mol. Mass.515.623
SMILESCC(C)(C)OC(=O)n1cc(C(=O)[C@@H]2CSC(N2)c2cccnc2)c2ccc(OCc3ccccc3)cc12