Reaction Details
TargetProlyl endopeptidase
LigandBDBM50038891
Substrate/Competitorn/a
Meas. Tech.ChEMBL_157472 (CHEMBL765791)
IC50 0.52±n/a nM
Citation Tanaka, YNiwa, SNishioka, HYamanaka, TTorizuka, MYoshinaga, KKobayashi, NIkeda, YArai, H New potent prolyl endopeptidase inhibitors: synthesis and structure-activity relationships of indan and tetralin derivatives and their analogues. J Med Chem37:2071-8 (1994) Prolyl endopeptidase
Name:Prolyl endopeptidase
Type:Enzyme
Mol. Mass.:80688.50
Organism:Homo sapiens (Human)
Description:P48147
Residue:710
BDBM50038891
NameBDBM50038891
Synonyms:(S)-1-[(S)-1-((S)-2-1,2,3,4-Tetrahydro-naphthalen-2-yl-acetyl)-pyrrolidine-2-carbonyl]-pyrrolidine-2-carbonitrile | CHEMBL63745
TypeSmall organic molecule
Emp. Form.C22H27N3O2
Mol. Mass.365.4687
SMILESO=C(C[C@H]1CCc2ccccc2C1)N1CCC[C@H]1C(=O)N1CCC[C@H]1C#N