Reaction Details
TargetProlyl endopeptidase
LigandBDBM50038897
Substrate/Competitorn/a
Meas. Tech.ChEMBL_157472 (CHEMBL765791)
IC50 0.45±n/a nM
Citation Tanaka, YNiwa, SNishioka, HYamanaka, TTorizuka, MYoshinaga, KKobayashi, NIkeda, YArai, H New potent prolyl endopeptidase inhibitors: synthesis and structure-activity relationships of indan and tetralin derivatives and their analogues. J Med Chem37:2071-8 (1994) Prolyl endopeptidase
Name:Prolyl endopeptidase
Type:Enzyme
Mol. Mass.:80688.50
Organism:Homo sapiens (Human)
Description:P48147
Residue:710
BDBM50038897
NameBDBM50038897
Synonyms:(S)-1-[(S)-1-((S)-2-1,2,3,4-Tetrahydro-naphthalen-2-yl-acetyl)-pyrrolidine-2-carbonyl]-pyrrolidine-2-carbaldehyde | CHEMBL65284
TypeSmall organic molecule
Emp. Form.C22H28N2O3
Mol. Mass.368.4693
SMILESO=C[C@@H]1CCCN1C(=O)[C@@H]1CCCN1C(=O)C[C@H]1CCc2ccccc2C1