Reaction Details
TargetProlyl endopeptidase
LigandBDBM50038898
Substrate/Competitorn/a
Meas. Tech.ChEMBL_157472 (CHEMBL765791)
IC50 0.42±n/a nM
Citation Tanaka, YNiwa, SNishioka, HYamanaka, TTorizuka, MYoshinaga, KKobayashi, NIkeda, YArai, H New potent prolyl endopeptidase inhibitors: synthesis and structure-activity relationships of indan and tetralin derivatives and their analogues. J Med Chem37:2071-8 (1994) Prolyl endopeptidase
Name:Prolyl endopeptidase
Type:Enzyme
Mol. Mass.:80688.50
Organism:Homo sapiens (Human)
Description:P48147
Residue:710
BDBM50038898
NameBDBM50038898
Synonyms:(S)-1-((S)-1-(2-(2,3-dihydro-1H-inden-2-yl)acetyl)pyrrolidine-2-carbonyl)pyrrolidine-2-carbaldehyde CHEMBL302654
TypeSmall organic molecule
Emp. Form.C21H26N2O3
Mol. Mass.354.4427
SMILESO=C[C@@H]1CCCN1C(=O)[C@@H]1CCCN1C(=O)CC1Cc2ccccc2C1