Reaction Details
TargetDelta-type opioid receptor
LigandBDBM50039028
Substrate/Competitorn/a
Meas. Tech.ChEMBL_145905 (CHEMBL750394)
IC50 0.200000±n/a nM
Citation Calderon, SNRothman, RBPorreca, FFlippen-Anderson, JLMcNutt, RWXu, HSmith, LEBilsky, EJDavis, PRice, KC Probes for narcotic receptor mediated phenomena. 19. Synthesis of (+)-4-[(alpha R)-alpha-((2S,5R)-4-allyl-2,5-dimethyl-1-piperazinyl)-3- methoxybenzyl]-N,N-diethylbenzamide (SNC 80): a highly selective, nonpeptide delta opioid receptor agonist. J Med Chem37:2125-8 (1994) Delta-type opioid receptor
Name:Delta-type opioid receptor
Type:Enzyme Catalytic Domain
Mol. Mass.:40577.25
Organism:MOUSE
Description:P32300
Residue:372
BDBM50039028
NameBDBM50039028
Synonyms:4-[(4-Allyl-2,5-dimethyl-piperazin-1-yl)-(3-hydroxy-phenyl)-methyl]-N,N-diethyl-benzamide | CHEMBL303855
TypeSmall organic molecule
Emp. Form.C27H37N3O2
Mol. Mass.435.6016
SMILESCCN(CC)C(=O)c1ccc(cc1)C(N1CC(C)N(CC=C)CC1C)c1cccc(O)c1