Reaction Details
TargetLactoylglutathione lyase
LigandBDBM50039110
Substrate/Competitorn/a
Meas. Tech.ChEMBL_71288 (CHEMBL684992)
Ki 1700±n/a nM
Citation Murthy, NSBakeris, TKavarana, MJHamilton, DSLan, YCreighton, DJ S-(N-aryl-N-hydroxycarbamoyl)glutathione derivatives are tight-binding inhibitors of glyoxalase I and slow substrates for glyoxalase II. J Med Chem37:2161-6 (1994) Lactoylglutathione lyase
Name:Lactoylglutathione lyase
Type:Enzyme
Mol. Mass.:20772.95
Organism:Homo sapiens (Human)
Description:Q04760
Residue:184
BDBM50039110
NameBDBM50039110
Synonyms:S-(N-Methyl-N-hydroxycarbomyl)ethylglutathione
TypeSmall organic molecule
Emp. Form.C7H11N2O6S
Mol. Mass.251.238
SMILESCN(O)C(=O)SCC(C([NH3+])C([O-])=O)C([O-])=O