Reaction Details
TargetNeutrophil elastase
LigandBDBM50039634
Substrate/Competitorn/a
Meas. Tech.ChEMBL_63980 (CHEMBL677606)
Ki 1±n/a nM
Citation Subramanyam, CBell, MRCarabateas, PCourt, JJDority, JAFerguson, EGordon, RHlasta, DJKumar, VSaindane, M 2,6-Disubstituted aryl carboxylic acids, leaving groups"par excellence" for benzisothiazolone inhibitors of human leukocyte elastase. J Med Chem37:2623-6 (1994) Neutrophil elastase
Name:Neutrophil elastase
Type:Enzyme
Mol. Mass.:28532.38
Organism:Homo sapiens (Human)
Description:P08246
Residue:267
BDBM50039634
NameBDBM50039634
Synonyms:2,6-Dichloro-benzoic acid 1,1,3-trioxo-4-phenyl-1,3-dihydro-1lambda*6*-benzo[d]isothiazol-2-ylmethyl ester | CHEMBL421162
TypeSmall organic molecule
Emp. Form.C21H13Cl2NO5S
Mol. Mass.462.303
SMILESClc1cccc(Cl)c1C(=O)OCN1C(=O)c2c(cccc2-c2ccccc2)S1(=O)=O