Reaction Details
TargetMu-type opioid receptor
LigandBDBM50029051
Substrate/Competitorn/a
Meas. Tech.ChEMBL_138892 (CHEMBL747884)
Ki 14000±n/a nM
Citation Zuckermann, RNMartin, EJSpellmeyer, DCStauber, GBShoemaker, KRKerr, JMFigliozzi, GMGoff, DASiani, MASimon, RJ Discovery of nanomolar ligands for 7-transmembrane G-protein-coupled receptors from a diverse N-(substituted)glycine peptoid library. J Med Chem37:2678-85 (1994) Mu-type opioid receptor
Name:Mu-type opioid receptor
Type:G Protein-Coupled Receptor (GPCR)
Mol. Mass.:44503.11
Organism:Rattus norvegicus (rat)
Description:Competition binding assays were carried out using membrane preparations from transfected HN9.10 cells that constitutively expressed the mu opioid receptor.
Residue:398
BDBM50029051
NameBDBM50029051
Synonyms:(-)-arterenol (-)-norepinephrine (R)-4-(2-amino-1-hydroxyethyl)-1,2-benzenediol (R)-norepinephrine CHEMBL1437 | NOREPINEPHRINE
TypeSmall organic molecule
Emp. Form.C8H11NO3
Mol. Mass.169.1778
SMILESNC[C@H](O)c1ccc(O)c(O)c1