Reaction Details
Target5-hydroxytryptamine receptor 1A
LigandBDBM50039807
Substrate/Competitorn/a
Meas. Tech.ChEMBL_1445 (CHEMBL616569)
Ki 0.73±n/a nM
Citation van Steen, BJvan Wijngaarden, ITulp, MTSoudijn, W Structure-affinity relationship studies on 5-HT1A receptor ligands. 2. Heterobicyclic phenylpiperazines with N4-aralkyl substituents. J Med Chem37:2761-73 (1994) 5-hydroxytryptamine receptor 1A
Name:5-hydroxytryptamine receptor 1A
Type:G Protein-Coupled Receptor (GPCR)
Mol. Mass.:46445.29
Organism:Rattus norvegicus (rat)
Description:Binding assays were performed using rat hippocampal membranes.
Residue:422
BDBM50039807
NameBDBM50039807
Synonyms:1-(2,3-Dihydro-benzo[1,4]dioxin-5-yl)-4-(2-phenoxy-ethyl)-piperazine; hydrochloride | CHEMBL542906
TypeSmall organic molecule
Emp. Form.C20H24N2O3
Mol. Mass.340.4162
SMILESC(CN1CCN(CC1)c1cccc2OCCOc12)Oc1ccccc1