Reaction Details
TargetCarbonic anhydrase 2
LigandBDBM50043901
Substrate/Competitorn/a
Meas. Tech.ChEMBL_45049 (CHEMBL658047)
Ki 3.6±n/a nM
Citation Hunt, CAMallorga, PJMichelson, SRSchwam, HSondey, JMSmith, RLSugrue, MFShepard, KL 3-substituted thieno[2,3-b][1,4]thiazine-6-sulfonamides. A novel class of topically active carbonic anhydrase inhibitors. J Med Chem37:240-7 (1994) Carbonic anhydrase 2
Name:Carbonic anhydrase 2
Type:Enzyme
Mol. Mass.:29250.71
Organism:Homo sapiens (Human)
Description:P00918
Residue:260
BDBM50043901
NameBDBM50043901
Synonyms:CHEMBL309950 | N-[2-(2-Methoxy-ethoxy)-ethyl]-N-(2-methoxy-ethyl)-2-(2,4,4-trioxo-6-sulfamoyl-1,2,3,4-tetrahydro-4lambda*6*-thieno[2,3-b][1,4]thiazin-3-yl)-acetamide
TypeSmall organic molecule
Emp. Form.C16H25N3O9S3
Mol. Mass.499.579
SMILESCOCCOCCN(CCOC)C(=O)CC1C(=O)Nc2cc(sc2S1(=O)=O)S(N)(=O)=O