Reaction Details
TargetCarbonic anhydrase 2
LigandBDBM50043907
Substrate/Competitorn/a
Meas. Tech.ChEMBL_45049 (CHEMBL658047)
Ki 2.9±n/a nM
Citation Hunt, CAMallorga, PJMichelson, SRSchwam, HSondey, JMSmith, RLSugrue, MFShepard, KL 3-substituted thieno[2,3-b][1,4]thiazine-6-sulfonamides. A novel class of topically active carbonic anhydrase inhibitors. J Med Chem37:240-7 (1994) Carbonic anhydrase 2
Name:Carbonic anhydrase 2
Type:Enzyme
Mol. Mass.:29250.71
Organism:Homo sapiens (Human)
Description:P00918
Residue:260
BDBM50043907
NameBDBM50043907
Synonyms:2,4,4-Trioxo-1,2,3,4-tetrahydro-4lambda*6*-thieno[2,3-b][1,4]thiazine-6-sulfonic acid amide | CHEMBL81148
TypeSmall organic molecule
Emp. Form.C6H6N2O5S3
Mol. Mass.282.317
SMILESNS(=O)(=O)c1cc2NC(=O)CS(=O)(=O)c2s1