Reaction Details
TargetCarbonic anhydrase 2
LigandBDBM50043912
Substrate/Competitorn/a
Meas. Tech.ChEMBL_45049 (CHEMBL658047)
Ki 4.1±n/a nM
Citation Hunt, CAMallorga, PJMichelson, SRSchwam, HSondey, JMSmith, RLSugrue, MFShepard, KL 3-substituted thieno[2,3-b][1,4]thiazine-6-sulfonamides. A novel class of topically active carbonic anhydrase inhibitors. J Med Chem37:240-7 (1994) Carbonic anhydrase 2
Name:Carbonic anhydrase 2
Type:Enzyme
Mol. Mass.:29250.71
Organism:Homo sapiens (Human)
Description:P00918
Residue:260
BDBM50043912
NameBDBM50043912
Synonyms:3-{2-[[2-(2-Methoxy-ethoxy)-ethyl]-(2-methoxy-ethyl)-amino]-ethyl}-4,4-dioxo-1,2,3,4-tetrahydro-4lambda*6*-thieno[2,3-b][1,4]thiazine-6-sulfonic acid amide | CHEMBL311263
TypeSmall organic molecule
Emp. Form.C16H29N3O7S3
Mol. Mass.471.612
SMILESCOCCOCCN(CCOC)CCC1CNc2cc(sc2S1(=O)=O)S(N)(=O)=O