Reaction Details
TargetOxytocin receptor
LigandBDBM50205990
Substrate/Competitorn/a
Meas. Tech.ChEMBL_148874 (CHEMBL882495)
Kd 6.7±n/a nM
Citation Pavo, ISlaninova, JKlein, UFahrenholz, F Enhanced selectivity of oxytocin antagonists containing sarcosine in position 7. J Med Chem37:255-9 (1994) Oxytocin receptor
Name:Oxytocin receptor
Type:Enzyme Catalytic Domain
Mol. Mass.:42793.26
Organism:Homo sapiens (Human)
Description:Oxytocin OXTR HEK293::B2R9L7
Residue:389
BDBM50205990
NameBDBM50205990
Synonyms:CHEMBL395429 | OXYTOCIN
TypeSmall organic molecule
Emp. Form.C43H66N12O12S2
Mol. Mass.1007.187
SMILESCC[C@H](C)[C@@H]1NC(=O)[C@H](Cc2ccc(O)cc2)NC(=O)[C@@H](N)CSSC[C@H](NC(=O)[C@H](CC(N)=O)NC(=O)[C@H](CCC(N)=O)NC1=O)C(=O)N1CCC[C@H]1C(=O)N[C@@H](CC(C)C)C(=O)NCC(N)=O