Reaction Details
TargetSodium channel protein type 2 subunit alpha
LigandBDBM50344821
Substrate/Competitorn/a
Meas. Tech.ChEMBL_144080 (CHEMBL751305)
IC50 14±n/a nM
Citation Roufos, IHays, SJDooley, DJSchwarz, RDCampbell, GWProbert, AW Synthesis and pharmacological evaluation of phenylacetamides as sodium-channel blockers. J Med Chem37:268-74 (1994) Sodium channel protein type 2 subunit alpha
Name:Sodium channel protein type 2 subunit alpha
Type:PROTEIN
Mol. Mass.:227854.11
Organism:Rattus norvegicus
Description:ChEMBL_1516893
Residue:2005
BDBM50344821
NameBDBM50344821
Synonyms:10-hydroxymethyl-5-imino-(2S)-12,13-dioxa-4,6-diazatetracyclo[7.3.1.13,11.03,8]tetradecane-1,2,7,10,14-pentaol CHEMBL507974 | tetrodotoxin
TypeSmall organic molecule
Emp. Form.C11H17N3O8
Mol. Mass.319.268
SMILESNC1=N[C@H](O)[C@H]2[C@H]3O[C@]4(O)O[C@@H]([C@@H](O)[C@@]2(N1)[C@@H]4O)[C@]3(O)CO