Reaction Details
TargetGag-Pol polyprotein [489-587]
LigandBDBM50368889
Substrate/Competitorn/a
Meas. Tech.ChEMBL_157711 (CHEMBL763385)
Ki 45±n/a nM
Citation Islam, INg, KYChong, KTMcQuade, TJHui, JOWilkinson, KFRush, BDRuwart, MJBorchardt, RTFisher, JF Evaluation of a vitamin-cloaking strategy for oligopeptide therapeutics: biotinylated HIV-1 protease inhibitors. J Med Chem37:293-304 (1994) Gag-Pol polyprotein [489-587]
Name:Gag-Pol polyprotein [489-587]
Type:Enzyme Subunit
Mol. Mass.:10781.16
Organism:Human immunodeficiency virus type 1
Description:P04585[489-587]
Residue:99
BDBM50368889
NameBDBM50368889
Synonyms:CHEMBL1790790
TypeSmall organic molecule
Emp. Form.C37H60N6O6S
Mol. Mass.716.974
SMILESCC[C@@H](C)[C@H](NC(=O)[C@H](C(C)C)[C@@H](O)[C@H](O)[C@H](CC1CCCCC1)NC(=O)CCCC[C@@H]1SCC2NC(=O)N[C@H]12)C(=O)NCc1ccccn1