Reaction Details
TargetCholecystokinin receptor type A
LigandBDBM50044038
Substrate/Competitorn/a
Meas. Tech.ChEMBL_49581 (CHEMBL661234)
IC50 1.7±n/a nM
Citation Elliott, RLKopecka, HBennett, MJShue, YKCraig, RLin, CWBianchi, BRMiller, TRWitte, DGStashko, MA Tetrapeptide CCK agonists: structure-activity studies on modifications at the N-terminus. J Med Chem37:309-13 (1994) Cholecystokinin receptor type A
Name:Cholecystokinin receptor type A
Type:n/a
Mol. Mass.:48229.77
Organism:Cavia porcellus
Description:n/a
Residue:430
BDBM50044038
NameBDBM50044038
Synonyms:(S)-N-((S)-1-Carbamoyl-2-phenyl-ethyl)-3-[(S)-2-[(S)-3-1H-indol-3-yl-2-(2,2,2-trifluoro-acetylamino)-propionylamino]-6-(3-o-tolyl-ureido)-hexanoylamino]-N-methyl-succinamic acid | CHEMBL104598
TypeSmall organic molecule
Emp. Form.C41H47F3N8O8
Mol. Mass.836.8559
SMILESCN([C@@H](Cc1ccccc1)C(N)=O)C(=O)[C@H](CC(O)=O)NC(=O)[C@H](CCCCNC(=O)Nc1ccccc1C)NC(=O)[C@H](Cc1c[nH]c2ccccc12)NC(=O)C(F)(F)F