Reaction Details
TargetCarnitine O-palmitoyltransferase 1, muscle isoform
LigandBDBM50037262
Substrate/Competitorn/a
Meas. Tech.ChEMBL_46319 (CHEMBL660720)
Ki 1400000±n/a nM
Citation Saeed, AMcMillin, JBWolkowicz, PEBrouillette, WJ 3-Amino-5,5-dimethylhexanoic acid. Synthesis, resolution, and effects on carnitine acyltransferases. J Med Chem37:3247-51 (1994) Carnitine O-palmitoyltransferase 1, muscle isoform
Name:Carnitine O-palmitoyltransferase 1, muscle isoform
Type:PROTEIN
Mol. Mass.:88241.28
Organism:Rattus norvegicus
Description:ChEMBL_887447
Residue:772
BDBM50037262
NameBDBM50037262
Synonyms:(R)-3-Hydroxy-5,5-dimethyl-hexanoic acid anion
TypeSmall organic molecule
Emp. Form.C8H15O3
Mol. Mass.159.2034
SMILESCC(C)(C)C[C@@H](O)CC([O-])=O