Reaction Details
TargetCarnitine O-palmitoyltransferase 1, muscle isoform
LigandBDBM50037268
Substrate/Competitorn/a
Meas. Tech.ChEMBL_46319 (CHEMBL660720)
Ki 100000±n/a nM
Citation Saeed, AMcMillin, JBWolkowicz, PEBrouillette, WJ 3-Amino-5,5-dimethylhexanoic acid. Synthesis, resolution, and effects on carnitine acyltransferases. J Med Chem37:3247-51 (1994) Carnitine O-palmitoyltransferase 1, muscle isoform
Name:Carnitine O-palmitoyltransferase 1, muscle isoform
Type:PROTEIN
Mol. Mass.:88241.28
Organism:Rattus norvegicus
Description:ChEMBL_887447
Residue:772
BDBM50037268
NameBDBM50037268
Synonyms:(-)-Carnitine (3R)-3-hydroxy-4-(trimethylammonio)butanoate CHEMBL1149 LEVOCARNITINE
TypeSmall organic molecule
Emp. Form.C7H15NO3
Mol. Mass.161.1989
SMILESC[N+](C)(C)C[C@H](O)CC([O-])=O