Reaction Details
TargetCarnitine O-palmitoyltransferase 2, mitochondrial
LigandBDBM50037268
Substrate/Competitorn/a
Meas. Tech.ChEMBL_46324 (CHEMBL660892)
Ki 100000±n/a nM
Citation Saeed, AMcMillin, JBWolkowicz, PEBrouillette, WJ 3-Amino-5,5-dimethylhexanoic acid. Synthesis, resolution, and effects on carnitine acyltransferases. J Med Chem37:3247-51 (1994) Carnitine O-palmitoyltransferase 2, mitochondrial
Name:Carnitine O-palmitoyltransferase 2, mitochondrial
Type:PROTEIN
Mol. Mass.:74118.53
Organism:Rattus norvegicus
Description:ChEMBL_887443
Residue:658
BDBM50037268
NameBDBM50037268
Synonyms:(-)-Carnitine (3R)-3-hydroxy-4-(trimethylammonio)butanoate CHEMBL1149 LEVOCARNITINE
TypeSmall organic molecule
Emp. Form.C7H15NO3
Mol. Mass.161.1989
SMILESC[N+](C)(C)C[C@H](O)CC([O-])=O