Reaction Details
TargetMu-type opioid receptor
LigandBDBM50037490
Substrate/Competitorn/a
Meas. Tech.ChEMBL_138873 (CHEMBL747865)
Ki 10000±n/a nM
Citation May, ELAceto, MDBowman, ERBentley, CMartin, BRHarris, LSMedzihradsky, FMattson, MVJacobson, AE Antipodal alpha-N-(methyl through decyl)-N-normetazocines (5,9 alpha-dimethyl-2'-hydroxy-6,7-benzomorphans): in vitro and in vivo properties. J Med Chem37:3408-18 (1994) Mu-type opioid receptor
Name:Mu-type opioid receptor
Type:G Protein-Coupled Receptor (GPCR)
Mol. Mass.:44503.11
Organism:Rattus norvegicus (rat)
Description:Competition binding assays were carried out using membrane preparations from transfected HN9.10 cells that constitutively expressed the mu opioid receptor.
Residue:398
BDBM50037490
NameBDBM50037490
Synonyms:(6R,11S)-3-Ethyl-6,11-dimethyl-1,2,3,4,5,6-hexahydro-2,6-methano-benzo[d]azocin-8-ol | CHEMBL325052
TypeSmall organic molecule
Emp. Form.C16H23NO
Mol. Mass.245.3599
SMILESCCN1CC[C@]2(C)[C@H](C)C1Cc1ccc(O)cc21