Reaction Details
TargetKappa-type opioid receptor
LigandBDBM50037483
Substrate/Competitorn/a
Meas. Tech.ChEMBL_145383 (CHEMBL750073)
Ki 113±n/a nM
Citation May, ELAceto, MDBowman, ERBentley, CMartin, BRHarris, LSMedzihradsky, FMattson, MVJacobson, AE Antipodal alpha-N-(methyl through decyl)-N-normetazocines (5,9 alpha-dimethyl-2'-hydroxy-6,7-benzomorphans): in vitro and in vivo properties. J Med Chem37:3408-18 (1994) Kappa-type opioid receptor
Name:Kappa-type opioid receptor
Type:G Protein-Coupled Receptor (GPCR)
Mol. Mass.:42648.76
Organism:Homo sapiens (Human)
Description:P41145
Residue:380
BDBM50037483
NameBDBM50037483
Synonyms:(+)-cis-N-Normetazocine CHEMBL114203
TypeSmall organic molecule
Emp. Form.C14H19NO
Mol. Mass.217.3068
SMILESC[C@H]1C2Cc3ccc(O)cc3[C@@]1(C)CCN2