Reaction Details
TargetSigma non-opioid intracellular receptor 1
LigandBDBM50037469
Substrate/Competitorn/a
Meas. Tech.ChEMBL_201749 (CHEMBL809883)
Ki 18100±n/a nM
Citation May, ELAceto, MDBowman, ERBentley, CMartin, BRHarris, LSMedzihradsky, FMattson, MVJacobson, AE Antipodal alpha-N-(methyl through decyl)-N-normetazocines (5,9 alpha-dimethyl-2'-hydroxy-6,7-benzomorphans): in vitro and in vivo properties. J Med Chem37:3408-18 (1994) Sigma non-opioid intracellular receptor 1
Name:Sigma non-opioid intracellular receptor 1
Type:Enzyme Catalytic Domain
Mol. Mass.:25124.85
Organism:Homo sapiens (Human)
Description:Q99720
Residue:223
BDBM50037469
NameBDBM50037469
Synonyms:(6S,11R)-3,6,11-Trimethyl-1,2,3,4,5,6-hexahydro-2,6-methano-benzo[d]azocin-8-ol | CHEMBL115917
TypeSmall organic molecule
Emp. Form.C15H21NO
Mol. Mass.231.3333
SMILESC[C@H]1C2Cc3ccc(O)cc3[C@@]1(C)CCN2C