Reaction Details
TargetAdenosylhomocysteinase
LigandBDBM50407233
Substrate/Competitorn/a
Meas. Tech.ChEMBL_196551 (CHEMBL801946)
Ki 110±n/a nM
Citation Wnuk, SFYuan, CSBorchardt, RTBalzarini, JDe Clercq, ERobins, MJ Nucleic acid related compounds. 84. Synthesis of 6'-(E and Z)-halohomovinyl derivatives of adenosine, inactivation of S-adenosyl-L-homocysteine hydrolase, and correlation of anticancer and antiviral potencies with enzyme inhibition. J Med Chem37:3579-87 (1994) Adenosylhomocysteinase
Name:Adenosylhomocysteinase
Type:PROTEIN
Mol. Mass.:47714.06
Organism:Homo sapiens (Human)
Description:ChEMBL_1507791
Residue:432
BDBM50407233
NameBDBM50407233
Synonyms:CHEMBL2092790
TypeSmall organic molecule
Emp. Form.C11H12ClN5O3
Mol. Mass.297.698
SMILESNc1ncnc2n(cnc12)[C@@H]1O[C@H](\C=C\Cl)[C@@H](O)[C@H]1O