Reaction Details
TargetGlyceraldehyde-3-phosphate dehydrogenase
LigandBDBM50037777
Substrate/Competitorn/a
Meas. Tech.ChEMBL_72902 (CHEMBL684096)
IC50>10000±n/a nM
Citation Verlinde, CLCallens, MVan Calenbergh, SVan Aerschot, AHerdewijn, PHannaert, VMichels, PAOpperdoes, FRHol, WG Selective inhibition of trypanosomal glyceraldehyde-3-phosphate dehydrogenase by protein structure-based design: toward new drugs for the treatment of sleeping sickness. J Med Chem37:3605-13 (1994) Glyceraldehyde-3-phosphate dehydrogenase
Name:Glyceraldehyde-3-phosphate dehydrogenase
Type:PROTEIN
Mol. Mass.:36060.86
Organism:Homo sapiens (Human)
Description:ChEMBL_1511315
Residue:335
BDBM50037777
NameBDBM50037777
Synonyms:CHEMBL120653 | N-[2-(6-Amino-purin-9-yl)-4-hydroxy-5-hydroxymethyl-tetrahydro-furan-3-yl]-benzamide
TypeSmall organic molecule
Emp. Form.C17H18N6O4
Mol. Mass.370.3626
SMILESNc1ncnc2n(cnc12)C1OC(CO)C(O)C1NC(=O)c1ccccc1