Reaction Details
TargetAdenosine receptor A3
LigandBDBM50453442
Substrate/Competitorn/a
Meas. Tech.ChEMBL_30614 (CHEMBL642021)
Ki 116±n/a nM
Citation Kim, HOJi, XDSiddiqi, SMOlah, MEStiles, GLJacobson, KA 2-Substitution of N6-benzyladenosine-5'-uronamides enhances selectivity for A3 adenosine receptors. J Med Chem37:3614-21 (1994) Adenosine receptor A3
Name:Adenosine receptor A3
Type:PROTEIN
Mol. Mass.:36643.73
Organism:Rattus norvegicus
Description:ChEMBL_479910
Residue:320
BDBM50453442
NameBDBM50453442
Synonyms:CHEMBL1256714
TypeSmall organic molecule
Emp. Form.C18H22N6O4
Mol. Mass.386.4051
SMILESNc1ccc(CCNc2ncnc3n(cnc23)[C@@H]2O[C@H](CO)[C@@H](O)[C@H]2O)cc1