Reaction Details
TargetAdenosine receptor A2a
LigandBDBM50088422
Substrate/Competitorn/a
Meas. Tech.ChEMBL_31068 (CHEMBL640428)
Ki 18±n/a nM
Citation Kim, HOJi, XDSiddiqi, SMOlah, MEStiles, GLJacobson, KA 2-Substitution of N6-benzyladenosine-5'-uronamides enhances selectivity for A3 adenosine receptors. J Med Chem37:3614-21 (1994) Adenosine receptor A2a
Name:Adenosine receptor A2a
Type:G Protein-Coupled Receptor (GPCR)
Mol. Mass.:45015.65
Organism:Rattus norvegicus (rat)
Description:Rat A2A receptors expressed in CHO cells.
Residue:410
BDBM50088422
NameBDBM50088422
Synonyms:(2R,3R,4S,5R)-2-(6-(3-iodobenzylamino)-9H-purin-9-yl)-5-(hydroxymethyl)-tetrahydrofuran-3,4-diol 2-Hydroxymethyl-5-[6-(3-iodo-benzylamino)-purin-9-yl]-tetrahydro-furan-3,4-diol | CHEMBL66393
TypeSmall organic molecule
Emp. Form.C17H18IN5O4
Mol. Mass.483.2604
SMILESOC[C@H]1O[C@H]([C@H](O)[C@@H]1O)n1cnc2c(NCc3cccc(I)c3)ncnc12