Reaction Details
TargetAdenosine receptor A1
LigandBDBM50118812
Substrate/Competitorn/a
Meas. Tech.ChEMBL_29642 (CHEMBL639749)
Ki 54±n/a nM
Citation Kim, HOJi, XDSiddiqi, SMOlah, MEStiles, GLJacobson, KA 2-Substitution of N6-benzyladenosine-5'-uronamides enhances selectivity for A3 adenosine receptors. J Med Chem37:3614-21 (1994) Adenosine receptor A1
Name:Adenosine receptor A1
Type:Protein
Mol. Mass.:36704.13
Organism:Rattus norvegicus (rat)
Description:n/a
Residue:326
BDBM50118812
NameBDBM50118812
Synonyms:(2S,3S,4R,5R)-3,4-Dihydroxy-5-[6-(3-iodo-benzylamino)-purin-9-yl]-tetrahydro-furan-2-carboxylic acid methylamide (2S,3S,4R,5R)-5-(6-(3-iodobenzylamino)-9H-purin-9-yl)-3,4-dihydroxy-N-methyl-tetrahydrofuran-2-carboxamide (3S,4R,5R)-3,4-Dihydroxy-5-[6-(3-iodo-benzylamino)-purin-9-yl]-tetrahydro-furan-2-carboxylic acid methylamide 3,4-Dihydroxy-5-[6-(3-iodo-benzylamino)-purin-9-yl]-tetrahydro-furan-2-carboxylic acid methylamide IB-MECA | N6-(3-iodobenzyl)-5'-N-methylcarboxamidoadenosine
TypeSmall organic molecule
Emp. Form.C18H19IN6O4
Mol. Mass.510.2857
SMILESCNC(=O)[C@H]1O[C@H]([C@H](O)[C@@H]1O)n1cnc2c(NCc3cccc(I)c3)ncnc12