Reaction Details
TargetLactase/phlorizin hydrolase
LigandBDBM50292389
Substrate/Competitorn/a
Meas. Tech.ChEMBL_96427 (CHEMBL706375)
IC50 1900±n/a nM
Citation Asano, NOseki, KKizu, HMatsui, K Nitrogen-in-the-ring pyranoses and furanoses: structural basis of inhibition of mammalian glycosidases. J Med Chem37:3701-6 (1994) Lactase/phlorizin hydrolase
Name:Lactase/phlorizin hydrolase
Type:PROTEIN
Mol. Mass.:217253.31
Organism:Rattus norvegicus
Description:ChEMBL_96426
Residue:1928
BDBM50292389
NameBDBM50292389
Synonyms:3-epi-fagomine CHEMBL456583
TypeSmall organic molecule
Emp. Form.C6H13NO3
Mol. Mass.147.1723
SMILESOC[C@H]1NCC[C@H](O)[C@@H]1O