Reaction Details
TargetSerine protease 1
LigandBDBM50038002
Substrate/Competitorn/a
Meas. Tech.ChEMBL_212378 (CHEMBL878759)
Ki 31±n/a nM
Citation Hilpert, KAckermann, JBanner, DWGast, AGubernator, KHadváry, PLabler, LMüller, KSchmid, GTschopp, TB Design and synthesis of potent and highly selective thrombin inhibitors. J Med Chem37:3889-901 (1994) Serine protease 1
Name:Serine protease 1
Type:Enzyme
Mol. Mass.:25790.52
Organism:Bos taurus (bovine)
Description:P00760
Residue:246
BDBM50038002
NameBDBM50038002
Synonyms:Benzamidine (Protonated) CHEMBL537204 | benzamidine
TypeSmall organic molecule
Emp. Form.C7H8N2
Mol. Mass.120.1518
SMILESNC(=N)c1ccccc1