Reaction Details
TargetProthrombin
LigandBDBM50037995
Substrate/Competitorn/a
Meas. Tech.ChEMBL_208319 (CHEMBL812837)
Ki 0.71±n/a nM
Citation Hilpert, KAckermann, JBanner, DWGast, AGubernator, KHadváry, PLabler, LMüller, KSchmid, GTschopp, TB Design and synthesis of potent and highly selective thrombin inhibitors. J Med Chem37:3889-901 (1994) Prothrombin
Name:Prothrombin
Type:Protein
Mol. Mass.:70029.57
Organism:Homo sapiens (Human)
Description:P00734
Residue:622
BDBM50037995
NameBDBM50037995
Synonyms:CHEMBL338669 | {[(S)-3-[((S)-1-Carbamimidoyl-piperidin-3-ylmethyl)-carbamoyl]-2-(naphthalene-2-sulfonylamino)-propionyl]-cyclohexyl-amino}-acetic acid
TypeSmall organic molecule
Emp. Form.C29H40N6O6S
Mol. Mass.600.729
SMILESNC(=N)N1CCC[C@@H](CNC(=O)C[C@H](NS(=O)(=O)c2ccc3ccccc3c2)C(=O)N(CC(O)=O)C2CCCCC2)C1