Reaction Details
TargetProthrombin
LigandBDBM50037984
Substrate/Competitorn/a
Meas. Tech.ChEMBL_208319 (CHEMBL812837)
Ki 0.86±n/a nM
Citation Hilpert, KAckermann, JBanner, DWGast, AGubernator, KHadváry, PLabler, LMüller, KSchmid, GTschopp, TB Design and synthesis of potent and highly selective thrombin inhibitors. J Med Chem37:3889-901 (1994) Prothrombin
Name:Prothrombin
Type:Protein
Mol. Mass.:70029.57
Organism:Homo sapiens (Human)
Description:P00734
Residue:622
BDBM50037984
NameBDBM50037984
Synonyms:CHEMBL339094 | {Butyl-[(S)-3-[((S)-1-carbamimidoyl-piperidin-3-ylmethyl)-carbamoyl]-2-(naphthalene-2-sulfonylamino)-propionyl]-amino}-acetic acid
TypeSmall organic molecule
Emp. Form.C27H38N6O6S
Mol. Mass.574.692
SMILESCCCCN(CC(O)=O)C(=O)[C@H](CC(=O)NC[C@@H]1CCCN(C1)C(N)=N)NS(=O)(=O)c1ccc2ccccc2c1