Reaction Details
TargetProthrombin
LigandBDBM50038001
Substrate/Competitorn/a
Meas. Tech.ChEMBL_208319 (CHEMBL812837)
Ki 20±n/a nM
Citation Hilpert, KAckermann, JBanner, DWGast, AGubernator, KHadváry, PLabler, LMüller, KSchmid, GTschopp, TB Design and synthesis of potent and highly selective thrombin inhibitors. J Med Chem37:3889-901 (1994) Prothrombin
Name:Prothrombin
Type:Protein
Mol. Mass.:70029.57
Organism:Homo sapiens (Human)
Description:P00734
Residue:622
BDBM50038001
NameBDBM50038001
Synonyms:(2R,4R)-1-((S)-5-(diaminomethyleneamino)-2-(3-methyl-1,2,3,4-tetrahydroquinoline-8-sulfonamido)pentanoyl)-4-methylpiperidine-2-carboxylic acid (2R,4S)-1-[5-Guanidino-2-(3-methyl-1,2,3,4-tetrahydro-quinoline-8-sulfonylamino)-pentanoyl]-4-methyl-piperidine-2-carboxylic acid (S)-1-[5-Guanidino-2-(3-methyl-1,2,3,4-tetrahydro-quinoline-8-sulfonylamino)-pentanoyl]-4-methyl-piperidine-2-carboxylic acid 1-[5-Guanidino-2-(3-methyl-1,2,3,4-tetrahydro-quinoline-8-sulfonylamino)-pentanoyl]-4-methyl-piperidine-2-carboxylic acid ARGATROBAN DK-7419 MCI-9038 | MD-805
TypeSmall organic molecule
Emp. Form.C23H36N6O5S
Mol. Mass.508.634
SMILESC[C@@H]1CCN([C@H](C1)C(O)=O)C(=O)[C@H](CCCNC(N)=N)NS(=O)(=O)c1cccc2CC(C)CNc12