Reaction Details
TargetMu-type opioid receptor
LigandBDBM50453485
Substrate/Competitorn/a
Meas. Tech.ChEMBL_138727 (CHEMBL747749)
IC50 0.300000±n/a nM
Citation Nelson, TDDavis, RDNelson, WL Synthesis and opioid receptor affinity of a series of aralkyl ethers of 6 alpha- and 6 beta-naltrexol. J Med Chem37:4270-7 (1995) Mu-type opioid receptor
Name:Mu-type opioid receptor
Type:Enzyme Catalytic Domain
Mol. Mass.:11165.58
Organism:GUINEA PIG
Description:P97266
Residue:98
BDBM50453485
NameBDBM50453485
Synonyms:CHEMBL2111914
TypeSmall organic molecule
Emp. Form.C27H31NO4
Mol. Mass.433.5393
SMILESOc1ccc2CC3N(CC4CC4)CCC45C(Oc1c24)[C@H](CCC35O)OCc1ccccc1