Reaction Details
TargetBifunctional dihydrofolate reductase-thymidylate synthase
LigandBDBM18512
Substrate/Competitorn/a
Meas. Tech.ChEMBL_53329 (CHEMBL664915)
IC50 390±n/a nM
Citation Rosowsky, AMota, CEWright, JEQueener, SF 2,4-Diamino-5-chloroquinazoline analogues of trimetrexate and piritrexim: synthesis and antifolate activity. J Med Chem37:4522-8 (1995) Bifunctional dihydrofolate reductase-thymidylate synthase
Name:Bifunctional dihydrofolate reductase-thymidylate synthase
Type:Enzyme
Mol. Mass.:68757.49
Organism:Toxoplasma gondii
Description:Q07422
Residue:610
BDBM18512
NameBDBM18512
Synonyms:5-(4-chlorophenyl)-6-ethylpyrimidine-2,4-diamine Pyrimethamine (Pyr) cid_4993
TypeSmall organic molecule
Emp. Form.C12H13ClN4
Mol. Mass.248.711
SMILESCCc1nc(N)nc(N)c1-c1ccc(Cl)cc1