Reaction Details
TargetNeutrophil elastase
LigandBDBM50035498
Substrate/Competitorn/a
Meas. Tech.ChEMBL_63990 (CHEMBL673100)
Ki 12±n/a nM
Citation Angelastro, MRBaugh, LEBey, PBurkhart, JPChen, TMDurham, SLHare, CMHuber, EWJanusz, MJKoehl, JR Inhibition of human neutrophil elastase with peptidyl electrophilic ketones. 2. Orally active PG-Val-Pro-Val pentafluoroethyl ketones. J Med Chem37:4538-53 (1995) Neutrophil elastase
Name:Neutrophil elastase
Type:Enzyme
Mol. Mass.:28532.38
Organism:Homo sapiens (Human)
Description:P08246
Residue:267
BDBM50035498
NameBDBM50035498
Synonyms:(S)-1-{(S)-3-Methyl-2-[4-(morpholine-4-carbonyl)-benzoylamino]-butyryl}-pyrrolidine-2-carboxylic acid (3,3,3-trifluoro-1-isopropyl-2-oxo-propyl)-amide | CHEMBL76669
TypeSmall organic molecule
Emp. Form.C28H37F3N4O6
Mol. Mass.582.6118
SMILESCC(C)[C@H](NC(=O)c1ccc(cc1)C(=O)N1CCOCC1)C(=O)N1CCC[C@H]1C(=O)NC(C(C)C)C(=O)C(F)(F)F