Reaction Details
Target5-hydroxytryptamine receptor 1A
LigandBDBM82517
Substrate/Competitorn/a
Meas. Tech.ChEMBL_1411 (CHEMBL616199)
Ki 0.60±n/a nM
Citation Zhuang, ZPKung, MPChumpradit, SMu, MKung, HF Derivatives of 4-(2'-methoxyphenyl)-1-[2'-(N-2"-pyridinyl-p-iodobenzamido)ethyl]pipera zine (p-MPPI) as 5-HT1A ligands. J Med Chem37:4572-5 (1995) 5-hydroxytryptamine receptor 1A
Name:5-hydroxytryptamine receptor 1A
Type:G Protein-Coupled Receptor (GPCR)
Mol. Mass.:46445.29
Organism:Rattus norvegicus (rat)
Description:Binding assays were performed using rat hippocampal membranes.
Residue:422
BDBM82517
NameBDBM82517
Synonyms:2-{4-[4-(2-Methoxy-phenyl)-piperazin-1-yl]-butyl}-isoindole-1,3-dione CHEMBL126632 NAN-190 | NSC_107966
TypeSmall organic molecule
Emp. Form.C23H27N3O3
Mol. Mass.393.4788
SMILESCOc1ccccc1N1CCN(CCCCN2C(=O)c3ccccc3C2=O)CC1