Reaction Details
Target5-hydroxytryptamine receptor 1A
LigandBDBM50035508
Substrate/Competitorn/a
Meas. Tech.ChEMBL_1412 (CHEMBL616200)
Ki 2.6±n/a nM
Citation Zhuang, ZPKung, MPChumpradit, SMu, MKung, HF Derivatives of 4-(2'-methoxyphenyl)-1-[2'-(N-2"-pyridinyl-p-iodobenzamido)ethyl]pipera zine (p-MPPI) as 5-HT1A ligands. J Med Chem37:4572-5 (1995) 5-hydroxytryptamine receptor 1A
Name:5-hydroxytryptamine receptor 1A
Type:G Protein-Coupled Receptor (GPCR)
Mol. Mass.:46445.29
Organism:Rattus norvegicus (rat)
Description:Binding assays were performed using rat hippocampal membranes.
Residue:422
BDBM50035508
NameBDBM50035508
Synonyms:4-Iodo-N-{2-[4-(2-methoxy-phenyl)-piperazin-1-yl]-ethyl}-N-pyridin-2-yl-benzamide p-MPPI
TypeSmall organic molecule
Emp. Form.C25H27IN4O2
Mol. Mass.542.4119
SMILESCOc1ccccc1N1CCN(CCN(C(=O)c2ccc(I)cc2)c2ccccn2)CC1