Reaction Details
TargetD(2) dopamine receptor
LigandBDBM50036760
Substrate/Competitorn/a
Meas. Tech.ChEMBL_59887 (CHEMBL673013)
Ki>10000±n/a nM
Citation Gilligan, PJKergaye, AALewis, BMMcElroy, JF Piperidinyltetralin sigma ligands. J Med Chem37:364-70 (1994) D(2) dopamine receptor
Name:D(2) dopamine receptor
Type:Cell-surface receptors
Mol. Mass.:50647.10
Organism:Homo sapiens (Human)
Description:P14416
Residue:443
BDBM50036760
NameBDBM50036760
Synonyms:6-chloro-1'-phenethylspiro[1,2,3,4-tetrahydronaphthalene-2,4'-(hexahydropyridine)]-1-one | CHEMBL122761
TypeSmall organic molecule
Emp. Form.C22H24ClNO
Mol. Mass.353.885
SMILESClc1ccc2C(=O)C3(CCN(CCc4ccccc4)CC3)CCc2c1