Reaction Details
TargetGlutamate dehydrogenase 1, mitochondrial
LigandBDBM50192456
Substrate/Competitorn/a
Meas. Tech.ChEMBL_71836 (CHEMBL683667)
Ki 3400±n/a nM
Citation Goldstein, BMLi, HJones, JPBell, JEZeidler, JPankiewicz, KWWatanabe, KA CNAD: a potent and specific inhibitor of alcohol dehydrogenase. J Med Chem37:392-9 (1994) Glutamate dehydrogenase 1, mitochondrial
Name:Glutamate dehydrogenase 1, mitochondrial
Type:PROTEIN
Mol. Mass.:61518.81
Organism:Bos taurus
Description:ChEMBL_71835
Residue:558
BDBM50192456
NameBDBM50192456
Synonyms:[(2R,3S,4R,5R)-5-(6-amino-9H-purin-9-yl)-3,4-dihydroxyoxolan-2-yl]methyl ({[(3R,4S)-5-(3-carbamoyl-1,4-dihydropyridin-1-yl)-3,4-dihydroxyoxolan-2-yl]methyl phosphonato}oxy)phosphonate
TypeSmall organic molecule
Emp. Form.C21H27N7O14P2
Mol. Mass.663.4262
SMILESNC(=O)C1=CN(C=CC1)C1OC(COP([O-])(=O)OP([O-])(=O)OC[C@H]2O[C@H]([C@H](O)[C@@H]2O)n2cnc3c(N)ncnc23)[C@H](O)[C@@H]1O