Reaction Details
TargetGlutamate dehydrogenase 1, mitochondrial
LigandBDBM50368954
Substrate/Competitorn/a
Meas. Tech.ChEMBL_71834 (CHEMBL683665)
Ki 15000±n/a nM
Citation Goldstein, BMLi, HJones, JPBell, JEZeidler, JPankiewicz, KWWatanabe, KA CNAD: a potent and specific inhibitor of alcohol dehydrogenase. J Med Chem37:392-9 (1994) Glutamate dehydrogenase 1, mitochondrial
Name:Glutamate dehydrogenase 1, mitochondrial
Type:PROTEIN
Mol. Mass.:61518.81
Organism:Bos taurus
Description:ChEMBL_71835
Residue:558
BDBM50368954
NameBDBM50368954
Synonyms:CHEMBL610377
TypeSmall organic molecule
Emp. Form.C21H27N7O14P2
Mol. Mass.663.4251
SMILESNC(=O)c1cncc(c1)[C@@H]1O[C@H](COP(O)(=O)OP(O)(=O)OC[C@H]2OC([C@H](O)[C@@H]2O)n2cnc3c(N)ncnc23)[C@@H](O)[C@H]1O