Reaction Details
TargetL-lactate dehydrogenase A chain
LigandBDBM50368954
Substrate/Competitorn/a
Meas. Tech.ChEMBL_96560 (CHEMBL709293)
Ki 188000±n/a nM
Citation Goldstein, BMLi, HJones, JPBell, JEZeidler, JPankiewicz, KWWatanabe, KA CNAD: a potent and specific inhibitor of alcohol dehydrogenase. J Med Chem37:392-9 (1994) L-lactate dehydrogenase A chain
Name:L-lactate dehydrogenase A chain
Type:Protein
Mol. Mass.:36694.85
Organism:Homo sapiens (Human)
Description:P00338::PDB Code: 4ajp
Residue:332
BDBM50368954
NameBDBM50368954
Synonyms:CHEMBL610377
TypeSmall organic molecule
Emp. Form.C21H27N7O14P2
Mol. Mass.663.4251
SMILESNC(=O)c1cncc(c1)[C@@H]1O[C@H](COP(O)(=O)OP(O)(=O)OC[C@H]2OC([C@H](O)[C@@H]2O)n2cnc3c(N)ncnc23)[C@@H](O)[C@H]1O