Reaction Details
TargetMu-type opioid receptor
LigandBDBM50056628
Substrate/Competitorn/a
Meas. Tech.ChEMBL_222067 (CHEMBL843459)
Ki 1.9±n/a nM
Citation Portoghese, PSSultana, MMoe, STTakemori, AE Synthesis of naltrexone-derived delta-opioid antagonists. Role of conformation of the delta address moiety. J Med Chem37:579-85 (1994) Mu-type opioid receptor
Name:Mu-type opioid receptor
Type:G Protein-Coupled Receptor (GPCR)
Mol. Mass.:44789.51
Organism:Homo sapiens (Human)
Description:P35372
Residue:400
BDBM50056628
NameBDBM50056628
Synonyms:4-cyclopropylmethyl-10,17-dihydroxy-15-[1-phenyl-(Z)-methylidene]-(5R,13R,17S)-12-oxa-4-azapentacyclo[9.6.1.01,13.05,17.07,18]octadeca-7(18),8,10-trien-14-one
TypeSmall organic molecule
Emp. Form.C27H27NO4
Mol. Mass.429.5076
SMILESOc1ccc2C[C@H]3N(CC4CC4)CCC45[C@@H](Oc1c24)C(=O)C(C[C@@]35O)=Cc1ccccc1