Reaction Details
TargetMu-type opioid receptor
LigandBDBM50040484
Substrate/Competitorn/a
Meas. Tech.ChEMBL_222067 (CHEMBL843459)
Ki 0.19±n/a nM
Citation Portoghese, PSSultana, MMoe, STTakemori, AE Synthesis of naltrexone-derived delta-opioid antagonists. Role of conformation of the delta address moiety. J Med Chem37:579-85 (1994) Mu-type opioid receptor
Name:Mu-type opioid receptor
Type:G Protein-Coupled Receptor (GPCR)
Mol. Mass.:44789.51
Organism:Homo sapiens (Human)
Description:P35372
Residue:400
BDBM50040484
NameBDBM50040484
Synonyms:14-anilino-4-cyclopropylmethyl-(13R,14R,17S)-12-oxa-4-azapentacyclo[9.6.1.01,13.05,17.07,18]octadeca-7,9,11(18)-triene-10,17-diol
TypeSmall organic molecule
Emp. Form.C26H30N2O3
Mol. Mass.418.528
SMILESOc1ccc2CC3N(CC4CC4)CC[C@@]45[C@@H](Oc1c24)[C@@H](CC[C@@]35O)Nc1ccccc1