Reaction Details
TargetDelta-type opioid receptor
LigandBDBM50040483
Substrate/Competitorn/a
Meas. Tech.ChEMBL_145064 (CHEMBL753995)
Ki 0.86±n/a nM
Citation Portoghese, PSSultana, MMoe, STTakemori, AE Synthesis of naltrexone-derived delta-opioid antagonists. Role of conformation of the delta address moiety. J Med Chem37:579-85 (1994) Delta-type opioid receptor
Name:Delta-type opioid receptor
Type:G Protein-Coupled Receptor (GPCR)
Mol. Mass.:40465.04
Organism:Rattus norvegicus (rat)
Description:Competition binding assays were using CHO-K1 cell membranes expressing the opioid receptor.
Residue:372
BDBM50040483
NameBDBM50040483
Synonyms:4-cyclopropylmethyl-10,17-dihydroxy-15-phenyl-(1S,13R,15R,17S)-12-oxa-4-azapentacyclo[9.6.1.01,13.05,17.07,18]octadeca-7,9,11(18)-trien-14-one
TypeSmall organic molecule
Emp. Form.C27H29NO4
Mol. Mass.431.5235
SMILESOc1ccc2CC3N(CC4CC4)CC[C@@]45[C@@H](Oc1c24)C(=O)[C@@H](Cc1ccccc1)C[C@@]35O