Reaction Details
TargetKappa-type opioid receptor
LigandBDBM50040482
Substrate/Competitorn/a
Meas. Tech.ChEMBL_145989 (CHEMBL750583)
Ki 25±n/a nM
Citation Portoghese, PSSultana, MMoe, STTakemori, AE Synthesis of naltrexone-derived delta-opioid antagonists. Role of conformation of the delta address moiety. J Med Chem37:579-85 (1994) Kappa-type opioid receptor
Name:Kappa-type opioid receptor
Type:G Protein-Coupled Receptor (GPCR)
Mol. Mass.:42744.99
Organism:Cavia porcellus (domestic guinea pig)
Description:P41144
Residue:380
BDBM50040482
NameBDBM50040482
Synonyms:17-(cyclopropylmethyl)-6,7-didehydro-4,5-alpha-epoxy-3,14-dihydroxy-6-(1'-spirobenzodioxalanyl)morphinan
TypeSmall organic molecule
Emp. Form.C26H27NO5
Mol. Mass.433.4963
SMILESOc1ccc2CC3N(CC4CC4)CC[C@@]45[C@@H](Oc1c24)C1(CC[C@@]35O)Oc2ccccc2O1