Reaction Details
TargetCholecystokinin receptor type A
LigandBDBM50004477
Substrate/Competitorn/a
Meas. Tech.ChEMBL_49710 (CHEMBL661162)
IC50 0.500000±n/a nM
Citation Holladay, MWKopecka, HMiller, TRBednarz, LNikkel, ALBianchi, BRWitte, DGShiosaki, KLin, CWAsin, KE Tetrapeptide CCK-A agonists: effect of backbone N-methylations on in vitro and in vivo CCK activity. J Med Chem37:630-5 (1994) Cholecystokinin receptor type A
Name:Cholecystokinin receptor type A
Type:n/a
Mol. Mass.:48229.77
Organism:Cavia porcellus
Description:n/a
Residue:430
BDBM50004477
NameBDBM50004477
Synonyms:CCK7 analogue N-(1-Carbamoyl-2-phenyl-ethyl)-3-({2-[3-(1H-indol-3-yl)-2-(2-{2-[3-(4-sulfonyl-oxy-phenyl)-propionylamino]-hexanoylamino}-acetylamino)-propionylamino]-hexanoyl}-methyl-amino)-succinamic acid
TypeSmall organic molecule
Emp. Form.C48H62N8O13S
Mol. Mass.991.117
SMILESCCCC[C@H](NC(=O)CCc1ccc(OS(O)(=O)=O)cc1)C(=O)NCC(=O)N[C@@H](Cc1c[nH]c2ccccc12)C(=O)N[C@@H](CCCC)C(=O)N(C)[C@@H](CC(O)=O)C(=O)N[C@@H](Cc1ccccc1)C(N)=O